usa asset
type: ObjectProperty
comment: Collegamento tra un progetto e l'asset semantico che usa.
comment: Link between a project and the semantic asset used in it. @en
range: SemanticAsset
domain: Project
label: uses asset @en