Opening Hours Specification
type: Class
comment: Individuals of this class specify opening hours specifications for locations/events for instance. The opening hours specifications are expressed in terms of * opening time * closure time * the day of the week to which the opening hours specification refer * the type of admission (daily, weekly, etc.)
version info: stabile @it
subclass of: Restriction
  max qualified cardinality: 1
  on class: AdmissionType
  on property: hasAdmissionType
version info: stable
subclass of: Restriction
  all values from: time
  on property: closes
subclass of: AccessCondition
label: Orario di Apertura @it
subclass of: Restriction
  all values from: time
  on property: opens
subclass of: Restriction
  all values from: DayOfWeek
  on property: hasDayOfWeek
subclass of: Restriction
  all values from: TimeInterval
  on property: atTime
comment: Individui di questa classe specificano gli orari di apertura (specifiche condizioni di accesso) a luoghi o eventi Gli orari di apertura sono espressi in termini di * orario apertura * orario di chiusura * il giorno della settimana a cui l'orario di apertura si riferisce * il tipo di apertura (settimanale, mensile, giornaliera, ecc) Con questa classe è possibile modellare dati di questo tipo "Orari di apertura (03/05 - 30/05/2018) lu - sa: 11:00 - 13:00 / 15:00 - 19:00". @it