orario di chiusura
type: DatatypeProperty
comment: Proprietà che rappresenta l'orario di chiusura o l'ora in cui una chiusura temporanea cessa di valere. Esempio: se la chiusura temporanea è Martedì dalle 10:00 alle 13:00 la proprietà modella "13:00"
comment: Property that represents the closing hour or the hour on which the temporary closure terminates. Example: if the temporary closure is on Tuesday from 10:00am to 13:00am, closes is used to model "13:00am". @en
domain: Class
  union of: OpeningHoursSpecification
  union of: TemporaryClosure
label: closes @en
range: time
version info: stable @en
version info: stabile