Area dell'Indirizzo
type: Class
version info: stabile
comment: E' una componente dell'indirizzo che rappresenta il nome di un'area geografica o di una località che raggruppa un numero di oggetti indirizzatibili, per scopi di indirizzamento, senza necessariamente essere un'unità amministrativa territoriale. Nell'ambito dell'anagrafe nazionale numeri civici e strade urbane (ANNCSU) la classe può essere usata per rappresentare la LOCALITA’: una porzione più o meno vasta di territorio comunale, sulla quale insistono una o più aree di circolazione (presente se fornita dal Comune).
label: Address Area @en
was influenced by: AddressAreaName
subclass of: Restriction
  some values from: Literal
  on property: name
version info: stable @en
subclass of: AddressComponent
comment: An address component which represents the name of a geographic area or a locality that groups a number of addressable objects for addressing purposes, without being an administrative unit. @en