Number of the Street
type: Class
subclass of: Restriction
  max cardinality: 1
  on property: metric
subclass of: Restriction
  max cardinality: 1
  on property: exponent
comment: Questa classe rappresenta il numero civico dell'indirizzo che individua l' ACCESSO ESTERNO, cioè quello che dall’area di circolazione immette, direttamente o indirettamente, alle unità ecografiche semplici ossia abitazioni, esercizi commerciali, uffici e simili. @it
label: Civic Numbering
subclass of: Restriction
  some values from: Literal
  on property: streetNumber
version info: stabile @it
subclass of: Restriction
  on data range: int
  qualified cardinality: 1
  on property: streetNumber
equivalent class: Restriction
  some values from: Thing
  on property:
    inverse of: hasNumber
was influenced by: AddressLocator
subclass of: Restriction
  some values from: Thing
  on property:
    inverse of: hasNumber
subclass of: Characteristic
label: Numerazione Civica @it
version info: stable
subclass of: Restriction
  max cardinality: 1
  on property: peculiarity
equivalent class: Restriction
  some values from: Literal
  on property: streetNumber
label: Numero Civico @it
comment: This class represents the civic number, the number of the street. They are the numbers that identify external accesses.