Ripartizione Geografica
type: Class
label: Geographical Distribution @en
comment: Questa classe rappresenta la ripartizione geografica del territorio italiano. Essa assume i valori predefiniti definiti nel seguente vocabolario controllato https://w3id.org/italia/controlled-vocabulary/territorial-classifications/geographical-distribution
comment: This class represents the geographical distribution of the Italian territory. It assumes the predefined values defined in the following controlled vocaulary https://w3id.org/italia/controlled-vocabulary/territorial-classifications/geographical-distribution @en
controlled vocabulary: geographical-distribution
subclass of: AdminUnitComponent
version info: stable @en
version info: stabile