Internal Access
type: Class
subclass of: Restriction
  all values from: Literal
  on property: staircase
subclass of: Restriction
  cardinality: 1
  on property: flatNumber
subclass of: Restriction
  some values from: Address
  on property: refersToExternalAccess
comment: Questa classe rappresenta i numeri interni, relativi alll'accesso interno associato all'accesso esterno. Gli accessi interni sono quelli che da spazi privati o da scale immettono direttamente alle unità ecografiche semplici ossia abitazioni, esercizi commerciali, uffici e simili. @it
version info: stabile @it
version info: stable
subclass of: Restriction
  max cardinality: 1
  on property: floor
subclass of: Restriction
  max cardinality: 1
  on property: exponent
subclass of: Characteristic
subclass of: Restriction
  max cardinality: 1
  on property: building
comment: This class represents the internal access that refers to the external access . The internal access consists of a set of informaton related to the Internal accesses (e.g., building, flat number) to private spaces or staircase that allow one to access to private residential units.
subclass of: Restriction
  max cardinality: 1
  on property: yard
label: Accesso Interno @it