altitudine
type: FunctionalProperty
type: DatatypeProperty
comment: Questa proprietà rappresenta l'altitudine, ovvero l'altezza di un oggetto spaziale rispetto alla superficie del livello medio del mare.. E' proprietà associata alla geometria. Nel caso di geometria associata all'indirizzo, la proprietà rappresenta l'altezza ortometrica dell’accesso esterno (civico) espressa nei sistemi di riferimento altimetrici nazionali ufficiali.
comment: The property represents the altitude, i.e., the height of an object or point in relation to sea level or ground level. It is associated with the geometry. @en
domain: Geometry
label: quota
label: altitude @en
range: Literal
version info: stable @en
version info: stabile