coordinata geografica
type: DatatypeProperty
range: Literal
label: geographical coordinate @en
version info: stable @en
version info: stabile
comment: This property represents the geographical coordinate of the Geometry @en
comment: Questa proprietà rappresenta le coordinate geografiche della Geometria.
domain: Geometry