numero appartamento
type: DatatypeProperty
label: flat number @en
label: interno
range: int
version info: stabile
version info: stable @en
comment: Valore del numero interno assegnato all’accesso interno secondo la successione naturale dei numeri;
comment: Value of the internal number assigned to the internal access according to the natural sequence of numbers @en
domain: InternalAccess