indirizzo completo
type: FunctionalProperty
type: DatatypeProperty
range: Literal
comment: L'indirizzo completo scritto come una stringa. L'uso di questa proprietà aiuta a comprendere l'indirizzo completo evitando possibili errori derivanti dal frazionamento dello stesso nelle sue rispettive componenti.
comment: The complete address written as a string, with or without formatting. The use of this property allows one not to incur in any misunderstandings that might arise through the breaking up of an address into its component parts. @en
version info: stabile
version info: stable @en
label: full address @en
domain: Address