ha indirizzo attuale
type: FunctionalProperty
version info: stabile
domain: Thing
inverse of: isAddressFor
comment: This property is used to link a thing to a current address. @en
comment: Questa proprietà consente di collegare una cosa del dominio da modellare con l'indirizzo attuale, corrente.
label: has current address @en
type: ObjectProperty
range: Address
version info: stable @en