has address in time
type: ObjectProperty
comment: Property that links any thing of the modelled domain with the situation of an address that changes over time.
comment: Proprietà che lega una qualsiasi cosa del dominio modellato alla situazione utilizzata per esprimere il cambiamento di un indirizzo nel tempo. @it
version info: stabile @it
version info: stable
label: ha indirizzo nel tempo @it
domain: Thing
range: AddressInTime
inverse of: isAddressInTimeFor