has census section
type: ObjectProperty
range: CensusSection
comment: Property that links an address, a specific city or an address area to its census section.
version info: stabile @it
label: ha sezione di censimento @it
comment: Proprietà che collega un accesso esterno, una città o un area dell'indirizzo a una sezione di censimento. @it
version info: stable
domain: Class
  union of: Address
  union of: AddressArea