has internal access
type: ObjectProperty
label: ha accesso interno @it
version info: stable
inverse of: refersToExternalAccess
comment: Inverse property of "refersToExternalAccess" used to link the external access to the internal one.
range: InternalAccess
domain: Address
comment: Proprietà inversa di "si rifierisce a accesso esterno". Consente di collegare l'accesso esterno all'accesso interno @it
version info: stabile @it