has province
type: ObjectProperty
range: Province
sub property of: hasAddressComponent
version info: stable
version info: stabile @it
label: ha provincia @it
comment: Questa proprietà collega l'indirizzo alla Provincia. Esempio di Provincia: "PA", "BO", "RM", ecc. @it
comment: This property links the address with the Province.
domain: Address