ha provincia
type: ObjectProperty
comment: Questa proprietà collega l'indirizzo alla Provincia. Esempio di Provincia: "PA", "BO", "RM", ecc.
comment: This property links the address with the Province. @en
domain: Address
label: has province @en
range: Province
sub property of: hasAddressComponent
version info: stable @en
version info: stabile