ha giurisdizione
type: ObjectProperty
comment: Proprietà che consente di esprimere la copertura spaziale di una cosa del dominio da modellare.
comment: Property used to model the spatial coverage of a thing of the modelled domain. @en
domain: Thing
label: has spatial coverage @en
label: ha copertura spaziale
range: Feature
version info: stable @en
version info: stabile