ha toponimo stradale
type: ObjectProperty
comment: Questa proprietà è usata per collegare l'indirizzo al suo toponymo stradale (o odonimo)
comment: This property is used to to link an address to the street toponym component of it. @en
domain: Address
label: has street toponym @en
label: ha odonimo
range: StreetToponym
sub property of: hasAddressComponent
version info: stable @en
version info: stabile