is address for
type: ObjectProperty
comment: Inverse property of has address that links the address to a thing.
comment: Proprietà inversa di ha indirizzo che collega l'indirizzo a una cosa del dominio da modellare. @it
domain: Address
label: è indirizzo per @it
range: Thing
version info: stable
version info: stabile @it