è indirizzo nel tempo per
type: ObjectProperty
range: Thing
comment: Proprietà che lega una cosa del dominio da modellare con la relazione n-aria indirizzo nel tempo.
domain: AddressInTime
version info: stable @en
version info: stabile
comment: Property that links a thing to its address in time reification. @en
label: is address in time for @en