longitude
type: DatatypeProperty
type: FunctionalProperty
range: Literal
version info: stable
version info: stabile @it
sub property of: coordinate
comment: This property allows one to specify the longitude. It is associated with the Geometry
comment: Questa proprietà rappresenta la longitudine ed è associata alla geometria. Nell'ambito dell'ANNCSU la longitudine dell'accesso è espressa nel Sistema di riferimento geodetico nazionale, costituito dalla realizzazione ETRF2000 – all’epoca 2008.0 – del Sistema di riferimento geodetico Europeo ETRS89 @it
domain: Geometry
label: longitudine @it