valore metrico
type: DatatypeProperty
version info: stable @en
version info: stabile
comment: Valore del numero civico assegnato all’accesso esterno espresso in metri, utilizzato in caso di adozione del sistema metrico anziché della successione naturale dei numeri
range: Literal
domain: CivicNumbering
label: metric @en