valore metrico
type: DatatypeProperty
comment: Valore del numero civico assegnato all’accesso esterno espresso in metri, utilizzato in caso di adozione del sistema metrico anziché della successione naturale dei numeri
domain: CivicNumbering
label: metric @en
range: Literal
version info: stable @en
version info: stabile