next address
type: ObjectProperty
comment: This property allows one to model an ordered sequence of addresses (that may be related to each other as a consequence of a change occured over time). In this specific case the property represents the next 'address in time' situation in the sequence.
comment: Questa proprietà consente di modellare una sequenza ordinata di indirizzi (che potrebbero essere relazionati l'uno con l'altro come conseguenza di un cambio nella denominaziona avvenuta nel tempo). Nel caso specifico di questa proprietà, essa rappresenta la situazione 'address in time' successiva nella sequenza. @it
domain: AddressInTime
label: indirizzo successivo @it
range: AddressInTime
version info: stable
version info: stabile @it