DUF (Denominazione Urbanistica uFficiale)
type: DatatypeProperty
domain: StreetToponym
comment: Property that identifies in the street toponym the official street name @en
version info: stabile
comment: Proprietà che identifica la parte di toponimo stradale chiamata DUF - Denominazione Urbanistica uFficiale
version info: stable @en
label: nome della strada
label: official street name @en
range: Literal
sub property of: name