indirizzo precedente
type: ObjectProperty
comment: Questa proprietà consente di modellare una sequenza ordinata di indirizzi (che potrebbero essere relazionati l'uno con l'altro come conseguenza di un cambio nella denominaziona avvenuta nel tempo). Nel caso specifico di questa proprietà, essa rappresenta la situazione 'address in time' precedente nella sequenza.
comment: This property allows one to model an ordered sequence of addresses (that may be related to each other as a consequence of a change occured over time). In this specific case the property represents the previous 'address in time' situation in the sequence. @en
range: AddressInTime
version info: stabile
version info: stable @en
domain: AddressInTime
label: previous address @en