situated within
type: TransitiveProperty
version info: stable
comment: La proprietà è utilizzata per abilitare il modello nell'esprimere che una certa componente dell'indirizzo nei dati forma una gerarchia. Esempio: un comune è situato in una provincia che è situata in una regione che è situata in uno stato. @it
range: AddressComponent
comment: It is used to enable the model to express that the subtypes of address components in the dataset form a hierarchy e.g. like: a municipality within a province, which is in turn within a region, in turn within country.
label: situato in @it
domain: AddressComponent
version info: stabile @it
type: ObjectProperty