Bilancio
type: Class
subclass of: Object
subclass of: Restriction
  max qualified cardinality: 1
  on data range: float
  on property: totalTaxBurden
subclass of: Restriction
  on data range: float
  qualified cardinality: 1
  on property: totalAmount
subclass of: Restriction
  qualified cardinality: 1
  on class: Year
  on property: hasYear
version info: provvisoria
version info: unstable @en
comment: Questa classe rappresenta le principali informazioni sul bilancio dell'organizzazione quali per esempio l'anno di riferimento, l'ammontare totale e l'onere complessivo.
label: Balance sheet @en