Bilancio
type: Class
comment: Questa classe rappresenta le principali informazioni sul bilancio dell'organizzazione quali per esempio l'anno di riferimento, l'ammontare totale e l'onere complessivo.
label: Balance sheet @en
subclass of: Object
subclass of: Restriction
  on class: Year
  on property: hasYear
  qualified cardinality: 1
subclass of: Restriction
  on data range: float
  on property: totalAmount
  qualified cardinality: 1
subclass of: Restriction
  max qualified cardinality: 1
  on data range: float
  on property: totalTaxBurden
version info: provvisoria
version info: unstable @en