Appartenenza
type: Class
subclass of: Restriction
  max qualified cardinality: 1
  on data range: double
  on property: remuneration
subclass of: TimeIndexedRole
subclass of: Restriction
  qualified cardinality: 1
  on class: Organization
  on property: employmentFor
comment: Questa classe rappresenta la natura di appartenenza di un agente di un'organizzazione. In particolare, la classe è una relazione ennaria che rappresenta una situazione che coinvolge un agente, un'organizzazione, i l ruolo che l'agente ricopre nell'organizzazione ed eventualment eil lasso temporale in cui quel ruolo è svolto. Esempio: la classe consente di rappresentare il ruolo di amministratore delegato di un'impresa in un certo lasso temporale oppure il ruolo di consigliere in una società partecipata di una pubblica amministrazione in un certo intervallo temporale.
comment: This class represents the nature of an Agent's membership of an organization. In particular, the class is an n-ary relationship (a situation) that involves an Agent, an Organization, a Role and a Time Period. @en
was influenced by: timeindexedsituation.owl
was influenced by: Membership
label: Employment @en
version info: stable @en
version info: stabile