codice IPA
type: FunctionalProperty
comment: Questa proprietà rappresenta il codice IPA, il codice univoco, assegnato all'organizzazione pubblica in fase di accreditamento presso l'indice nazionale PA (IPA). Il Codice IPA viene comunicato tramite e-mail dal Gestore dell'IPA al referente dell'Ente.
label: IPA code @en
version info: stable @en
sub property of: identifier
range: Literal
version info: stabile
label: codice Indice PA
domain: PublicOrganization
type: DatatypeProperty
comment: This property represents the unique identifier of a public organization assigned when it is registered in the Italian national registry of Public Administrations (IPA). @en