Legal Status
type: Class
comment: This class represents the legal form/status of the private organization. The instances of this class can be represented as skos concepts of a controlled vocabulary.
comment: Questa classe rappresenta la forma giuridica di un'organizzazione privata (impresa). Le istanze di questa classe possono essere rappresentate da concetti dello standard skos di un vocabolario controllato. Esempi di forma giuridica per le imprese sono: "Impresa Individuale", "società a responsabilità limitata", ecc. @it
label: Forma Giuridica @it
subclass of: Characteristic
version info: stable
version info: stabile @it
controlledvocabulary: legal-status