Participation Type
type: Class
version info: stable
version info: stabile @it
comment: This class represents the type of participation of an organization in another. The class is materialized with two possible values "Direct" "Indirect" participation.
comment: Questa classe rappresenta il tipo di partecipazione di un'organizzazione in un'altra. Essa assume al momento due valori "Diretta" e "Indiretta". @it
label: Tipo Partecipazione @it
subclass of: Characteristic