Tipo Attività Organizzazione Privata
type: Class
comment: This class specializes the class Activity Type in order to represent the classification of the private organization based on its purpose or activity type. In the Italian context the istances of this class are those of the controlled vocabulary Ateco2007 (Italian variant of NACE v2.0) used in the Italian company registry. The controlled vocabulary is available at the following URI: https://w3id.org/italia/controlled-vocabulary/classifications-for-organizations/ateco-2007 @en
version info: unstable @en
label: Private Organization Activity Type @en
subclass of: ActivityType
controlledvocabulary: ateco-2007
version info: provvisoria
comment: Questa classe specializza la classe Tipo di Attività per poter rappresentare la classificazione di un organizzazione privata sulla base del proprio scopo o tipo di attività svolta. Nel contesto italiano, le istanze di questa classe sono quelle del vocabolario controllato Ateco2007 utilizzato nel registro imprese. Il vocabolario controllato è disponibile al seguente URI https://w3id.org/italia/controlled-vocabulary/classifications-for-organizations/ateco-2007