Amministrazione pubblica
type: Class
version info: stable @en
comment: Questa classe rappresenta un'organizzazione pubblica. Una pubblica amministrazione e qualsiasi altra organizzazione di nautra pubblica può essere modellata utilizzando questa classe. In generale, individui di questa classe sono organizzazioni registrate presso l'Indice della PA (IPA). Questa classe deriva dall'analoga classe del Core Public Organization Vocabulary.
subclass of: Restriction
  all values from: PublicOrgActivityType
  on property: hasPublicOrgActivityType
subclass of: Organization
subclass of: Restriction
  qualified cardinality: 1
  on class: PublicOrganizationCategory
  on property: hasCategory
label: Public Organization @en
label: organizzazione pubblica
version info: stabile
comment: This class represents a public organization. Thus, a public administration is a public organization. Any other organization that is defined public can be modelled using this class. This class is derived from the Core Public Organization Vocabulary. @en
subclass of: Restriction
  cardinality: 1
  on property: IPAcode