Public Organization Category
type: Class
controlledvocabulary: S13
label: Categoria Organizzazione Pubblica @it
version info: stable
comment: Questa classe rappresenta la cateogoria dell'organizzazione pubblica. Le istanze di questa classe possono essere modellate come concetti dello standard skos di un vocabolario controllato. Esempi includono: "Agenzie ed Enti per il Turismo", "Città Metropolitane", "Presidenza del Consiglio, Minsiteri e Avvocatura dello Stato". @it
comment: This class represents the category of the public organization. The instances of this class can be modelled as concept of the skos standard of a controlled vocabulary.
subclass of: Characteristic