numero REA
type: DatatypeProperty
version info: stabile
range: Literal
version info: stable @en
label: REA number @en
sub property of: identifier
comment: Questa proprietà rappresenta il numero REA (Repertorio Economico Amministrativo) associato a un'impresa. Il numero REA è costituito da un numero decimale progressivo ed è sempre associato ad una codifica, che precede il numero progressivo, della provincia/CCIAA che lo ha assegnato e, nella prassi, comprende anche tale codifica (ad es. RM-123456). Ogni soggetto/impresa obbligato per legge all´iscrizione al REA riceve un numero REA diverso per ogni provincia/CCIAA in cui apre Sede/Unità Locali.
comment: This property represents a specific code named REA number associated with the registration of a private organization in the related Italian national registry. @en
domain: PrivateOrganization