Divisione
type: Class
label: Support Unit (Department) @en
label: Unità di supporto
label: Dipartimento
label: Department @en
comment: This class represents a generic support unit/division of an organization. An alternative name can be department. In the italian context there are two main types of support unit; namely, the homogeneous organizational area and the office. This is an astract class that is instantitate with the two above two types. @en
comment: Questa classe rappresenta una generica unità di supporto o unità/divisione dell'organizzazione. Un nome alternativo potrebbe essere anche Dipartimento. Essa, nel contesto italiano, si suddivide in due tipologie di unità di supporto: Area Organizzativa Omogena e Ufficio (unità organizzativa). Questa è una classe astratta istanziata nei dati con i due precedenti tipi.
version info: stabile
version info: stable @en
was influenced by: OrganizationalUnit
subclass of: Organization