Partita Iva
type: FunctionalProperty
domain: PrivateOrganization
sub property of: identifier
label: VAT number @en
version info: stabile
version info: stable @en
range: Literal
comment: Questa proprietà rappresenta il numero di Partita IVA di un'organizzazione privata (impresa).
comment: This property represents the VAT number of a private organization. @en
type: DatatypeProperty