nome alternativo
type: DatatypeProperty
label: alternative name @en
range: Literal
comment: This property represents an alternative name for the organization such as a colloquial name. @en
sub property of: name
version info: Questa proprietà rappresenta un nome alternativo dell'organizzazione (e.g., un nome colloquiale).
version info: stabile
version info: stable @en
domain: Organization