business objective
type: DatatypeProperty
comment: This property represents the business objectives or the corporate purpose of the private organization.
label: oggetto sociale @it
comment: Questa proprietà rappresenta l'oggetto sociale dell'organizzazione privata (impresa). @it
domain: PrivateOrganization
range: Literal
version info: unstable
version info: provvisoria @it