appartenenza per
type: ObjectProperty
comment: Questa proprietà lega la situazione appartenenza all'organizzazione.
comment: This property links the situation Membership to the organization. @en
version info: stable @en
version info: stabile
range: Organization
label: membership for @en
label: employment for @en
label: impiego per
domain: Employment
sub property of: forEntity