appartenenza per
type: ObjectProperty
comment: Questa proprietà lega la situazione appartenenza all'organizzazione.
comment: This property links the situation Membership to the organization. @en
domain: Employment
label: membership for @en
label: employment for @en
label: impiego per
range: Organization
sub property of: forEntity
version info: stable @en
version info: stabile