foundation date
type: DatatypeProperty
label: data di costituzione @it
comment: This property represents the date in which the organization was founded.
comment: Questa proprietà rappresenta la data di costituzione dell'organizzazione privata (impresa). @it
domain: PrivateOrganization
range: dateTime
version info: stable
version info: stabile @it
sub property of: date