ha tipo di attività
type: ObjectProperty
comment: Questa proprietà lega un'organizzazione con il tipo di funzioni/attività svolte.
comment: This property links an organization with the type of function/activities it carries out. @en
domain: Organization
label: has activity type @en
range: ActivityType
version info: unstable @en
version info: provvisoria