foglio di bilancio
type: ObjectProperty
label: ha bilancio
label: has balance sheet @en
comment: This property links the Organization with one or more balance sheets. @en
comment: Questa proprietà lega un'organizzazione a uno o più bilanci.
domain: Organization
version info: stable @en
version info: stabile
range: BalanceSheet