has logo
type: ObjectProperty
comment: This property links the organization to the Image object representing the logo of the organization.
comment: Questa proprietà collega un'organizzazione a un oggetto immagine e rappresenta il logo dell'organizzazione. @it
domain: Organization
label: ha logo @it
range: Image
sub property of: hasImage
version info: stable
version info: stabile @it