ha tipo di partecipazione nell'organizzazione
type: ObjectProperty
comment: This property links the Participation to its type (i.e., direct or indirect). @en
version info: stable @en
version info: stabile
domain: Participation
label: has participation type @en
comment: Questa proprietà collega la partecipazione al suo tipo (diretta o indiretta).
range: ParticipationType