has participation type
type: ObjectProperty
comment: This property links the Participation to its type (i.e., direct or indirect).
comment: Questa proprietà collega la partecipazione al suo tipo (diretta o indiretta). @it
domain: Participation
label: ha tipo di partecipazione nell'organizzazione @it
range: ParticipationType
version info: stable
version info: stabile @it